{"text_format":"1","workbook":"xlsx","n_sheets":17,"sheets":["FVRA Result","Introduction","Accountant's Certificate","Result","1.Provider Details","2.Profit & Loss","3.Balance Sheet","4.Cashflow ","5.Bank, Debtors & Creditors","6.Student Numbers & Course Fees","7.Key Expenses","8. ASQA Review","Risk Settings & Weightings","Grey Rating Calculation","Section Checks & Step 1 Calcs ","Risk Calculations","Data Source"],"not_rendered":{"charts":0,"images":4,"macros":1,"external_links":0,"defined_names":57,"comments":4,"pivot_tables":0},"unopened":[],"bounds":{"document_bytes":16777216,"sheet_cells":100000,"rows_first":2000,"rows_last":500,"rows_between":2000,"halvings":0,"cell_chars":16384,"cell_head_chars":4096},"cells_cut":0,"cells_raw":0,"read":"whole","date_system":"1900"}

{"sheet":"FVRA Result","index":0,"n_rows":65,"n_cols":10,"rows_kept":65,"cut":false,"hidden":true,"merged":[]}
[]
[]
[]
[]
[]
[null,null,null,null,null,"Financial Risk",null,null,{"$f":"'Risk Calculations'!H51","v":10},{"$f":"IF('Risk Calculations'!H51> 3, \"Tool Incomplete\", '8. ASQA Review'!I37)","v":"Tool Incomplete"}]
[]
[null,null,null,null,null,"Non Financial Risk",null,null,{"$f":"'Grey Rating Calculation'!C70","v":10},{"$f":"'Grey Rating Calculation'!C69","v":"Ignore current rating, not yet assessed."}]
[null,"FVRA - Result",null,null,null,"Decision",null,null,{"$f":"IF('8. ASQA Review'!J63=\"\", \"No Decision\", '8. ASQA Review'!J63)","v":"No Decision"}]
[]
[null,"General Information"]
[]
[null,null,"Tool Type",null,{"$f":"App_Type","v":0}]
[]
[null,null,"Legal Entity Type",null,{"$f":"'1.Provider Details'!J14","v":0}]
{"$rows_left_out":51}
{"sheet":"Introduction","index":1,"n_rows":67,"n_cols":4,"rows_kept":67,"cut":false,"hidden":false,"merged":[[26,7,26,8],[5,7,5,8],[7,7,7,8]]}
[null,null,null,"V2"]
[]
[]
[]
[]
[]
[]
[]
[null,"Financial Viability Risk Assessment (FVRA) Tool "]
[]
[null,"Introduction"]
[]
[null,"The Financial Viability Risk Assessment (FVRA) tool is used by the Australian Skills Quality Authority (ASQA) to assess whether an applicant or existing RTO/CRICOS provider meets the Financial Viability Risk Assessment Requirements and/or the requirements of section 11 of the ESOS Act. The tool and supporting evidence is used to evaluate the likelihood of business continuity and capacity to achieve quality outcomes. In particular, the assessment informs a judgment about whether the organisation has the financial resources necessary to: \n\n"]
[null,"• acquire the requisite assets and physical resources to deliver all qualifications on its scope of registration"]
[null,"• employ sufficient appropriately qualified staff to cover the courses for which it takes enrolments"]
{"$rows_left_out":53}
{"sheet":"Accountant's Certificate","index":2,"n_rows":47,"n_cols":2,"rows_kept":47,"cut":false,"hidden":false,"merged":[[48,1,48,2],[5,7,5,8],[9,7,9,8],[8,1,8,2],[22,1,22,2],[20,1,20,2],[24,0,24,2],[25,0,25,2],[19,0,19,2],[18,0,18,2],[14,0,14,1],[13,0,13,1],[15,0,15,1],[16,0,16,1],[11,0,11,1],[30,1,30,2],[28,0,28,2],[12,0,12,2],[27,0,27,2],[26,0,26,2],[29,0,29,2]]}
[]
[]
[]
[]
[]
[]
[]
[null,"Instructions:"]
[null,"Please Print & have this form completed by  the nominated accountant. A signed nominated accountant’s certificate (signed within the last 30 days) is a required attachment. "]
[]
[null,"Nominated Accountant’s Certificate "]
[]
["Identifiers of Entity [Source: Australian Business Register]"]
["Australian Business Number:"]
["Entity Name:"]
{"$rows_left_out":33}
{"sheet":"Result","index":3,"n_rows":31,"n_cols":8,"rows_kept":31,"cut":false,"hidden":false,"merged":[[16,6,16,7],[19,6,19,7],[8,6,9,7],[29,2,29,7],[30,2,31,7],[12,4,12,7],[26,4,26,7]]}
[]
[]
[]
[]
[]
[]
[null,null,null,null,null,"Financial Risk ",{"$f":"'Risk Calculations'!H51","v":10}]
[]
[null,"FVRA - Result",null,null,null,"Recommendation",{"$f":"'Risk Calculations'!I51","v":"Tool is incomplete. Not ready to submit"}]
[null,null,{"$f":"\" \"","v":" "}]
[null,null,null,null,null,null,null,{"$f":"IF(TRIM(C31)<>\"\", \"(See the botton of page for specific issues to correct)\", \"\")","v":{"$error":"#NAME?"}}]
[]
[]
[null,"General Information"]
[]
{"$rows_left_out":17}
{"sheet":"1.Provider Details","index":4,"n_rows":128,"n_cols":12,"rows_kept":128,"cut":false,"hidden":false,"merged":[[108,3,108,8],[0,12,0,13],[12,3,12,6],[25,3,25,8],[24,3,24,8],[23,3,23,8],[21,3,21,8],[19,3,19,7],[16,3,16,6],[14,3,14,6],[13,3,13,6],[102,3,102,7],[85,3,85,7],[15,3,15,6]]}
[]
[]
[]
[]
[]
[]
[]
[]
[null,"FVRA - Provider Details"]
[]
[]
[null,1.1000000000000001,null,"Background",null,null,null,null,null,"Response"]
[null,null,"ⓘ","Tool Type"]
[null,null,"ⓘ","Legal Entity Type"]
[null,null,"ⓘ","Legal Entity Name"]
{"$rows_left_out":114}
{"sheet":"2.Profit & Loss","index":5,"n_rows":61,"n_cols":22,"rows_kept":61,"cut":false,"hidden":false,"merged":[[8,8,8,19]]}
[]
[]
[]
[]
[]
[]
[]
[]
[null,"FVRA - Profit & Loss Statement ",null,null,null,null,null,null,"Forecast year one columns – contains forecast amounts for future months as well as actual amounts for any months in which trading has already occurred"]
[]
[null,null,null,null,null,"Year -2 (Actual)",{"$f":"'Data Source'!B138","v":"Year -2 (Actual)"},{"$f":"'Data Source'!B139","v":"Year -1 (Actual)"},{"$f":"'Data Source'!B140","v":"Forecast Month 1"},{"$f":"'Data Source'!B141","v":"Forecast Month 2"},{"$f":"'Data Source'!B142","v":"Forecast Month 3"},{"$f":"'Data Source'!B143","v":"Forecast Month 4"},{"$f":"'Data Source'!B144","v":"Forecast Month 5"},{"$f":"'Data Source'!B145","v":"Forecast Month 6"},{"$f":"'Data Source'!B146","v":"Forecast Month 7"},{"$f":"'Data Source'!B147","v":"Forecast Month 8"},{"$f":"'Data Source'!B148","v":"Forecast Month 9"},{"$f":"'Data Source'!B149","v":"Forecast Month 10"},{"$f":"'Data Source'!B150","v":"Forecast Month 11"},{"$f":"'Data Source'!B151","v":"Forecast Month 12"},{"$f":"'Data Source'!B152","v":"Forecast Year 1"},{"$f":"'Data Source'!B153","v":"Forecast Year 2"}]
[null,"REVENUE"]
[null,null,"Training Revenue"]
[null,null,"ⓘ","VET Student Loans",null,null,null,null,null,null,null,null,null,null,null,null,null,null,null,null,{"$f":"SUM(I14:T14)","v":0}]
[null,null,"ⓘ","Government Funding - state based funding",null,null,null,null,null,null,null,null,null,null,null,null,null,null,null,null,{"$f":"SUM(I15:T15)","v":0}]
{"$rows_left_out":47}
{"sheet":"3.Balance Sheet","index":6,"n_rows":67,"n_cols":23,"rows_kept":67,"cut":false,"hidden":false,"merged":[[8,9,8,20]]}
[]
[]
[]
[]
[]
[]
[]
[]
[null,"FVRA - Balance Sheet ",null,null,null,null,null,null,null,"Forecast year one columns – contains forecast amounts for future months as well as actual amounts for any months in which trading has already occurred"]
[null,null,null,null,null,null,null,{"$f":"IF(H60<>H67,\"Out of Balance\",\"\")","v":""},{"$f":"IF(I60<>I67,\"Out of Balance\",\"\")","v":""},"","","","","","","","","","","","","",""]
[null,null,null,null,null,null,null,{"$f":"'Data Source'!B138","v":"Year -2 (Actual)"},{"$f":"'Data Source'!B139","v":"Year -1 (Actual)"},{"$f":"'Data Source'!B140","v":"Forecast Month 1"},{"$f":"'Data Source'!B141","v":"Forecast Month 2"},{"$f":"'Data Source'!B142","v":"Forecast Month 3"},{"$f":"'Data Source'!B143","v":"Forecast Month 4"},{"$f":"'Data Source'!B144","v":"Forecast Month 5"},{"$f":"'Data Source'!B145","v":"Forecast Month 6"},{"$f":"'Data Source'!B146","v":"Forecast Month 7"},{"$f":"'Data Source'!B147","v":"Forecast Month 8"},{"$f":"'Data Source'!B148","v":"Forecast Month 9"},{"$f":"'Data Source'!B149","v":"Forecast Month 10"},{"$f":"'Data Source'!B150","v":"Forecast Month 11"},{"$f":"'Data Source'!B151","v":"Forecast Month 12"},{"$f":"'Data Source'!B152","v":"Forecast Year 1"},{"$f":"'Data Source'!B153","v":"Forecast Year 2"}]
[null,"ASSETS"]
[null,null,"Current Assets"]
[null,null,"ⓘ","Cash and cash equivalents including overdraft accounts\n(Overdraft accounts to be included as a negative whole number)",null,null,null,null,null,null,null,null,null,null,null,null,null,null,null,null,null,{"$f":"U14","v":0}]
[null,null,"ⓘ","Related party receivables/loans",null,null,null,null,null,null,null,null,null,null,null,null,null,null,null,null,null,{"$f":"U15","v":0}]
{"$rows_left_out":53}
{"sheet":"4.Cashflow ","index":7,"n_rows":42,"n_cols":23,"rows_kept":42,"cut":false,"hidden":false,"merged":[[8,7,8,22],[9,9,9,21]]}
[]
[]
[]
[]
[]
[]
[]
[]
[null,"FVRA - Cash flow ",null,null,null,null,null,"Please enter all cash outflows as negative values"]
[null,null,null,null,null,null,null,null,null,"Forecast year one columns – contains forecast amounts for future months as well as actual amounts for any months in which trading has already occurred"]
[null,null,null,null,null,null,null,{"$f":"'Data Source'!B138","v":"Year -2 (Actual)"},{"$f":"'Data Source'!B139","v":"Year -1 (Actual)"},{"$f":"'Data Source'!B140","v":"Forecast Month 1"},{"$f":"'Data Source'!B141","v":"Forecast Month 2"},{"$f":"'Data Source'!B142","v":"Forecast Month 3"},{"$f":"'Data Source'!B143","v":"Forecast Month 4"},{"$f":"'Data Source'!B144","v":"Forecast Month 5"},{"$f":"'Data Source'!B145","v":"Forecast Month 6"},{"$f":"'Data Source'!B146","v":"Forecast Month 7"},{"$f":"'Data Source'!B147","v":"Forecast Month 8"},{"$f":"'Data Source'!B148","v":"Forecast Month 9"},{"$f":"'Data Source'!B149","v":"Forecast Month 10"},{"$f":"'Data Source'!B150","v":"Forecast Month 11"},{"$f":"'Data Source'!B151","v":"Forecast Month 12"},{"$f":"'Data Source'!B152","v":"Forecast Year 1"},{"$f":"'Data Source'!B153","v":"Forecast Year 2"}]
[]
[null,"CASH FLOWS FROM OPERATING ACTIVITIES"]
[null,"ⓘ","Cash Receipts from Students/Customers",null,null,null,null,null,null,null,null,null,null,null,null,null,null,null,null,null,null,{"$f":"SUM(J14:U14)","v":0}]
[null,"ⓘ","Cash paid to suppliers and employees",null,null,null,null,null,null,null,null,null,null,null,null,null,null,null,null,null,null,0]
{"$rows_left_out":28}
{"sheet":"5.Bank, Debtors & Creditors","index":8,"n_rows":37,"n_cols":11,"rows_kept":37,"cut":false,"hidden":false,"merged":[]}
[]
[]
[]
[]
[]
[]
[]
[]
[null,null,"FVRA - Bank Accounts, Debtors & Creditors"]
[]
[null,null,"Bank Accounts",null,null,null,"ⓘ","ⓘ",null,"ⓘ","ⓘ"]
[null,null,"Bank details (including Banking Institution; account name; account number)","Current Bank Balance per most recent Bank Statement","Approved facility limit (if loan / overdraft)","Balance per the accounts as at the last financial year end date","Has the bank account been reconciled to the accounts and the bank reconciliation statement provided?","Bank statement           last financial year","Balance per the accounts as at the last monthly accounts","Has the bank account been reconciled to the accounts and the bank reconciliation statement provided?","Bank statement           last monthly accounts"]
[]
[]
[]
{"$rows_left_out":23}
{"sheet":"6.Student Numbers & Course Fees","index":9,"n_rows":117,"n_cols":100,"rows_kept":117,"cut":false,"hidden":false,"merged":[[12,1,12,14],[11,1,11,14],[14,5,14,7],[14,9,14,14],[22,15,22,16],[23,15,23,16],[24,15,24,16],[25,15,25,16],[97,15,97,16],[51,15,51,16],[52,15,52,16],[53,15,53,16],[54,15,54,16],[55,15,55,16],[46,15,46,16],[47,15,47,16],[48,15,48,16],[49,15,49,16],[50,15,50,16],[61,15,61,16],[62,15,62,16],[63,15,63,16],[64,15,64,16],[65,15,65,16],[98,15,98,16],[99,15,99,16],[100,15,100,16],[14,68,14,83],[14,84,14,99],[114,15,114,16],[115,15,115,16],[15,15,15,16],[108,15,108,16],[109,15,109,16],[110,15,110,16],[111,15,111,16],[112,15,112,16],[113,15,113,16],[102,15,102,16],[103,15,103,16],[104,15,104,16],[105,15,105,16],[106,15,106,16],[107,15,107,16],[16,15,16,16],[17,15,17,16],[18,15,18,16],[14,16,14,17],[101,15,101,16],[19,15,19,16],[20,15,20,16],[21,15,21,16],[31,15,31,16],[32,15,32,16],[33,15,33,16],[34,15,34,16],[35,15,35,16],[26,15,26,16],[27,15,27,16],[28,15,28,16],[29,15,29,16],[30,15,30,16],[41,15,41,16],[42,15,42,16],[43,15,43,16],[44,15,44,16],[45,15,45,16],[36,15,36,16],[37,15,37,16],[38,15,38,16],[39,15,39,16],[40,15,40,16],[56,15,56,16],[57,15,57,16],[58,15,58,16],[59,15,59,16],[60,15,60,16],[71,15,71,16],[72,15,72,16],[73,15,73,16],[74,15,74,16],[75,15,75,16],[66,15,66,16],[67,15,67,16],[68,15,68,16],[69,15,69,16],[70,15,70,16],[81,15,81,16],[82,15,82,16],[83,15,83,16],[84,15,84,16],[85,15,85,16],[76,15,76,16],[77,15,77,16],[78,15,78,16],[79,15,79,16],[80,15,80,16],[96,15,96,16],[91,15,91,16],[92,15,92,16],[93,15,93,16],[94,15,94,16],[95,15,95,16],[86,15,86,16],[87,15,87,16],[88,15,88,16],[89,15,89,16],[90,15,90,16]]}
[]
[]
[]
[]
[]
[]
[]
[]
[null,"FVRA - Student Numbers & Course Fees - Commencing Students"]
[]
[null,"Instructions"]
[null,"List information in the table below for all courses that you are currently registered to deliver as well as any new courses for which you have applied.\n\nFor each time period, include the total number or students who are or were enrolled during the time period (this includes both existing/continuing students as well as new students who enrolled withing that period).\n\nFor each training product with a different course fee, please complete a new row.\nFor example:"]
[null,"If delivering SIT20316 Certificate II in Hospitality where the online mode of delivery is charged at $1000, but the face to face mode of delivery is charged at $3000, this training product should be listed on two rows to identify this difference. \n"]
[]
[null,null,null,null,"ⓘ","Delivery mode",null,null,"ⓘ","Client cohort",null,null,null,null,null,"ⓘ","Duration",null,"ⓘ Delivery location",null,null,null,null,null,null,null,null,null,null,null,null,null,null,null,null,null,null,null,null,null,null,null,null,null,null,null,null,null,null,null,null,null,null,null,null,null,null,null,null,null,null,null,null,null,null,null,null,null,"Number of Students",null,null,null,null,null,null,null,null,null,null,null,null,null,null,null,"Course fees multiplied by student numbers"]
{"$rows_left_out":103}
{"sheet":"7.Key Expenses","index":10,"n_rows":89,"n_cols":18,"rows_kept":89,"cut":false,"hidden":false,"merged":[[10,1,10,5],[51,1,51,4],[38,1,38,4],[39,1,39,4],[40,1,40,4],[41,1,41,4],[45,1,45,4],[44,1,44,4],[43,1,43,4],[42,1,42,4],[46,1,46,4],[47,1,47,4],[48,1,48,4],[49,1,49,4],[50,1,50,4],[11,4,11,15],[63,1,63,4],[52,1,52,4],[53,1,53,4],[54,1,54,4],[55,1,55,4],[56,1,56,4],[57,1,57,4],[58,1,58,4],[59,1,59,4],[60,1,60,4],[61,1,61,4],[62,1,62,4],[72,1,72,4],[73,1,73,4],[74,1,74,4],[75,1,75,4],[64,1,64,4],[65,1,65,4],[66,1,66,4],[67,1,67,4],[68,1,68,4],[69,1,69,4],[88,1,88,4],[35,1,35,7],[82,1,82,4],[83,1,83,4],[84,1,84,4],[85,1,85,4],[86,1,86,4],[87,1,87,4],[76,1,76,4],[77,1,77,4],[78,1,78,4],[79,1,79,4],[80,1,80,4],[81,1,81,4],[70,1,70,4],[71,1,71,4]]}
[]
[]
[]
[]
[]
[]
[]
[]
[null,"FVRA - Key Expenses"]
[]
[null,"ⓘ Staff Numbers (FTE Basis)\nNote: One Full-time Equivalent (\"FTE\") is equivalent to a full-time worker. If you have one or more part-time workers during any period, you should count them as a decimal value representing their percentage of hours compared to a full-time worker. \n\nFor example: if, during a relevant period, the organisation has a worker who works 50% of the hours of a full-time worker and another who works 70% of the hours of a full-time worker, they would be counted as 0.5 and 0.7 respectively. These numbers should be added to the number of full-time workers during the period to get the total numbers of staff (FTE)."]
[null,null,null,null,"Forecast year one columns – contains forecast amounts for future months as well as actual amounts for any months in which trading has already occurred"]
[null,"Teaching staff",{"$f":"'Data Source'!B138","v":"Year -2 (Actual)"},{"$f":"'Data Source'!B139","v":"Year -1 (Actual)"},{"$f":"'Data Source'!B140","v":"Forecast Month 1"},{"$f":"'Data Source'!B141","v":"Forecast Month 2"},{"$f":"'Data Source'!B142","v":"Forecast Month 3"},{"$f":"'Data Source'!B143","v":"Forecast Month 4"},{"$f":"'Data Source'!B144","v":"Forecast Month 5"},{"$f":"'Data Source'!B145","v":"Forecast Month 6"},{"$f":"'Data Source'!B146","v":"Forecast Month 7"},{"$f":"'Data Source'!B147","v":"Forecast Month 8"},{"$f":"'Data Source'!B148","v":"Forecast Month 9"},{"$f":"'Data Source'!B149","v":"Forecast Month 10"},{"$f":"'Data Source'!B150","v":"Forecast Month 11"},{"$f":"'Data Source'!B151","v":"Forecast Month 12"},{"$f":"'Data Source'!B152","v":"Forecast Year 1"},{"$f":"'Data Source'!B153","v":"Forecast Year 2"}]
[null,"Permanent",null,null,null,null,null,null,null,null,null,null,null,null,null,null,{"$f":"P14","v":0}]
[null,"Contract",null,null,null,null,null,null,null,null,null,null,null,null,null,null,{"$f":"P15","v":0}]
{"$rows_left_out":75}
{"sheet":"8. ASQA Review","index":11,"n_rows":64,"n_cols":9,"rows_kept":64,"cut":false,"hidden":true,"merged":[[58,3,58,7],[9,7,9,8],[10,7,10,8],[47,3,47,7],[46,3,46,7],[45,3,45,7],[44,3,44,7],[43,3,43,7],[42,3,42,7],[41,3,41,7],[21,3,21,7],[39,3,39,7],[40,3,40,7],[36,8,37,9],[48,3,48,7],[57,3,57,7],[51,3,51,7],[50,3,50,7],[49,3,49,7],[56,3,56,7],[55,3,55,7],[54,3,54,7],[53,3,53,7],[52,3,52,7]]}
[]
[]
[]
[]
[]
[]
[]
[]
[null,"FVRA - ASQA Review"]
[]
[]
[null,"Initial Assessment & Referral Review"]
[]
[null,8.1,null,"General"]
[null,null,"ⓘ","Have all required sections been completed?"]
{"$rows_left_out":50}
{"sheet":"Risk Settings & Weightings","index":12,"n_rows":78,"n_cols":12,"rows_kept":78,"cut":false,"hidden":false,"merged":[[63,2,63,3]]}
[]
[]
[]
[]
[]
[]
[]
[]
[null,"FVRA - Risk Settings & Weightings"]
[]
[]
[null,"Financial Viability Metrics"]
[]
[null,"Profit & Loss"]
[null,"Item","Name ","Purpose","Calculation","Unit","Limit Type (Low)","Low Risk (Green)","Medium Risk (Yellow)","High Risk (Red)","Weight Factor","Comments"]
{"$rows_left_out":64}
{"sheet":"Grey Rating Calculation","index":13,"n_rows":73,"n_cols":7,"rows_kept":73,"cut":false,"hidden":true,"merged":[[66,2,66,4]]}
[]
[]
[]
[]
[]
[]
[]
[]
[null,"Grey Rating Check"]
[null,null,null,"Original VBA intact?:",{"$f":"testMacrosAvailable()","v":{"$error":"#NAME?"}}]
[null,"Overall Check's - Applicant",null,"error message:",{"$f":"IF(E10=TRUE, \"\", \"The Financial Viability Risk Assessment tool is a \"\".xlsm\"\" file and must only be saved as a \"\".xlsm\"\" filetype. The current file either is not a \"\".xlsm\"\" file or has previously, at some point, been saved as a filetype other than \"\".xlsm\"\"\" & \". Please download a new copy of the Financial Viability Risk Assessment tool from www.asqa.gov.au and complete that file instead.\")","v":{"$error":"#NAME?"}}]
[]
[null,"Number","Name ","Result","Error Message"]
[null,1,"Application Type Check",{"$f":"IF(OR(ISBLANK(App_Type), App_Type = \"-- Select --\"), 1, 0)","v":1},{"$f":"IF(D14=0, \"\", \"You must enter an 'Application Type' at section 1.1 'Background' of tab '1.Provider Details'\")","v":"You must enter an 'Application Type' at section 1.1 'Background' of tab '1.Provider Details'"}]
[null,2,"Non Financial Metrics",{"$f":"IF(SUM(D22:D29)>0, 1, 0)","v":1}]
{"$rows_left_out":59}
{"sheet":"Section Checks & Step 1 Calcs ","index":14,"n_rows":61,"n_cols":5,"rows_kept":61,"cut":false,"hidden":true,"merged":[[53,2,53,3],[60,2,60,3]]}
[]
[]
[]
[]
[]
[]
[]
[]
[null,"Section  Checks"]
[]
[null,"Item","Name ","Check"]
[null,1,"Start-up Check",{"$f":"IF('1.Provider Details'!J13='Data Source'!$B$12, 1,0)","v":0}]
[null,2,"Group Structure Check",{"$f":"IF('1.Provider Details'!J20=Yes, 1,0)","v":0}]
[null,3,"Financial Guarantee Check",{"$f":"IF('1.Provider Details'!J22=Yes, 1,0)","v":0}]
[null,4,"Super Check",{"$f":"IF('1.Provider Details'!J93=No, 1, 0)","v":0}]
{"$rows_left_out":47}
{"sheet":"Risk Calculations","index":15,"n_rows":52,"n_cols":17,"rows_kept":52,"cut":false,"hidden":true,"merged":[[31,2,44,2],[13,2,19,2],[20,2,24,2],[25,2,26,2],[29,5,29,7],[29,8,29,10],[44,15,44,16],[43,15,43,16],[42,15,42,16],[41,15,41,16],[40,15,40,16],[39,15,39,16],[38,15,38,16],[37,15,37,16],[36,15,36,16],[11,5,11,7],[11,8,11,10],[13,15,26,15],[50,5,51,5],[50,6,51,6],[50,7,51,7],[50,8,51,8],[35,15,35,16],[34,15,34,16],[33,15,33,16],[32,15,32,16],[31,15,31,16],[13,12,26,12],[13,14,26,14],[31,12,44,12],[31,14,44,14]]}
[]
[]
[]
[]
[]
[]
[]
[]
[null,"FVRA - Risk Calculation"]
[]
[null,"Financial Viability Metrics"]
[null,null,null,null,null,"Actual Last Year",null,null,"Forecast Year 1"]
[null,"Item","Area ","Name ","Calculation","Provider Result","Score","Weighted Score","Provider Result","Score","Weighted Score","Blended Score","Standard Weighting","Weighted Score","Risk Rating","Decision","Comments"]
[null,1,"P & L",{"$f":"'Risk Settings & Weightings'!C16","v":"Training revenue as % of total revenue"},"Total Training Revenue / Total Revenue",{"$f":"IFERROR('2.Profit & Loss'!H22/'2.Profit & Loss'!$H$29,0)","v":0},{"$f":"IF(F14>='Risk Settings & Weightings'!H16,Green,IF(F14>='Risk Settings & Weightings'!I16,Yellow,IF(F14<'Risk Settings & Weightings'!J16,Red,0)))","v":1},{"$f":"G14*IF(App_Type ='Data Source'!$B$12, 'Risk Settings & Weightings'!$E$68, IF(App_Type ='Data Source'!$B$13, 'Risk Settings & Weightings'!$E$69, IF(App_Type ='Data Source'!$B$14, 'Risk Settings & Weightings'!$E$70, 0)))","v":0},{"$f":"IFERROR('2.Profit & Loss'!U22/'2.Profit & Loss'!$U$29,0)","v":0},{"$f":"IF(I14>='Risk Settings & Weightings'!H16,Green,IF(I14>='Risk Settings & Weightings'!I16,Yellow,IF(I14<'Risk Settings & Weightings'!J16,Red,0)))","v":1},{"$f":"J14*IF(App_Type ='Data Source'!$B$12, 'Risk Settings & Weightings'!$F$68, IF(App_Type ='Data Source'!$B$13, 'Risk Settings & Weightings'!$F$69, IF(App_Type ='Data Source'!$B$14, 'Risk Settings & Weightings'!$F$70, 0)))","v":0},{"$f":"SUM(H14,K14)","v":0},{"$f":"1/COUNT(B14:B27)","v":7.1428571428571425E-2},{"$f":"L14*$M$14*'Risk Settings & Weightings'!K16","v":0},{"$f":"SUM(N14:N27)","v":0.1607142857142857},{"$f":"IF(O14>='Risk Settings & Weightings'!C62, \"Submit Application\", \"Do Not Submit Application\")","v":"Do Not Submit Application"}]
[null,2,null,{"$f":"'Risk Settings & Weightings'!C17","v":"% Government funded"},"Government sourced training revenue / Total Revenue",{"$f":"IFERROR(('2.Profit & Loss'!H14+'2.Profit & Loss'!H15)/'2.Profit & Loss'!$H$29,0)","v":0},{"$f":"IF(F15<='Risk Settings & Weightings'!H17,Green,IF(F15<='Risk Settings & Weightings'!I17,Yellow,IF(F15>'Risk Settings & Weightings'!J17,Red,0)))","v":3},{"$f":"G15*IF(App_Type ='Data Source'!$B$12, 'Risk Settings & Weightings'!$E$68, IF(App_Type ='Data Source'!$B$13, 'Risk Settings & Weightings'!$E$69, IF(App_Type ='Data Source'!$B$14, 'Risk Settings & Weightings'!$E$70, 0)))","v":0},{"$f":"IFERROR(('2.Profit & Loss'!U14+'2.Profit & Loss'!U15)/'2.Profit & Loss'!$U$29,0)","v":0},{"$f":"IF(I15<='Risk Settings & Weightings'!H17,Green,IF(I15<='Risk Settings & Weightings'!I17,Yellow,IF(I15>'Risk Settings & Weightings'!J17,Red,0)))","v":3},{"$f":"J15*IF(App_Type ='Data Source'!$B$12, 'Risk Settings & Weightings'!$F$68, IF(App_Type ='Data Source'!$B$13, 'Risk Settings & Weightings'!$F$69, IF(App_Type ='Data Source'!$B$14, 'Risk Settings & Weightings'!$F$70, 0)))","v":0},{"$f":"SUM(H15,K15)","v":0},null,{"$f":"L15*$M$14*'Risk Settings & Weightings'!K17","v":0}]
{"$rows_left_out":38}
{"sheet":"Data Source","index":16,"n_rows":153,"n_cols":2,"rows_kept":153,"cut":false,"hidden":true,"merged":[]}
[]
[]
[]
[]
[]
[]
[]
[null,"FVRA - Data Source"]
[]
[null,"Application Type"]
[null,"-- Select --"]
[null,"New Registration (Start-up Business)"]
[null,"New Registration (Existing Business)"]
[null,"Monitoring Review"]
[]
{"$rows_left_out":138}